BDBM100225 MLS001018548::SMR000354787::cid_9689367
SMILES [H]C12CC3([H])C4C1CC1C2C3([H])C(\C(C)=N\NC(N)=S)C41[H]
InChI Key InChIKey=ALFWJIDUOABPHT-AYSLTRBKSA-N
Data  2 IC50
  Tab Delimited (TSV)   2D SDfile   Computed 3D by Vconf -m prep SDfile
Find this compound or compounds like it in BindingDB:
Activity Spreadsheet -- Enzyme Inhibition Constant Data from BindingDB
Found 2 hits for monomerid = 100225
TargetTegument protein VP16(Human herpesvirus 1 (strain 17) (HHV-1) (Human her...)
The Scripps Research Institute Molecular Screening Center
Curated by PubChem BioAssay
LigandPNGBDBM100225(MLS001018548 | SMR000354787 | cid_9689367)
Affinity DataIC50:  8.54E+4nM. Assay description: Source (MLPCN Center Name): The Scripps Research Institute Molecular Screening Center Affiliation: The Scripps Research Institute, TSRI Assay Provide...
Ligand InfoPC cidPC sid
In DepthDetails PCBioAssay
TargetCOUP transcription factor 2(Homo sapiens (Human))
The Scripps Research Institute Molecular Screening Center
Curated by PubChem BioAssay
LigandPNGBDBM100225(MLS001018548 | SMR000354787 | cid_9689367)
Affinity DataIC50:  6.40E+3nM
Ligand InfoPC cidPC sid
In DepthDetails PCBioAssay