BDBM100308 US8501749, 8
SMILES Cc1cccc2n(C)cc(Cn3c4cccnc4c(=O)n(CC(O)=O)c3=O)c12
InChI Key InChIKey=CLLDZHPASCKTKT-UHFFFAOYSA-N
Data  1 IC50
  Tab Delimited (TSV)   2D SDfile   Computed 3D by Vconf -m prep SDfile
Find this compound or compounds like it in BindingDB:
Activity Spreadsheet -- Enzyme Inhibition Constant Data from BindingDB
Found 1 hit for monomerid = 100308
TargetChymase(Homo sapiens (Human))
Boehringer Ingelheim International
US Patent
LigandPNGBDBM100308(US8501749, 8)
Affinity DataIC50:  6.10nMpH: 8.0 T: 2°C. Assay description: In vitro inhibition assay of Chymase.
In DepthDetails US Patent