BDBM100318 US8501749, 18
SMILES CCCC[C@H](C(O)=O)n1c(=O)n(Cc2nsc3cc(C)cc(C)c23)c2ccncc2c1=O
InChI Key InChIKey=PQTKWSBVWLMSOF-GOSISDBHSA-N
Data  1 IC50
  Tab Delimited (TSV)   2D SDfile   Computed 3D by Vconf -m prep SDfile
Find this compound or compounds like it in BindingDB:
Activity Spreadsheet -- Enzyme Inhibition Constant Data from BindingDB
Found 1 hit for monomerid = 100318
TargetChymase(Homo sapiens (Human))
Boehringer Ingelheim International
US Patent
LigandPNGBDBM100318(US8501749, 18)
Affinity DataIC50:  2.60nMpH: 8.0 T: 2°C. Assay description: In vitro inhibition assay of Chymase.
In DepthDetails US Patent