BDBM100337 US8501749, 37
SMILES CC[C@@H](C(O)=O)n1c(=O)n(Cc2nsc3cc(C)cc(C)c23)c2cccnc2c1=O
InChI Key InChIKey=KUZGYFDAONROEN-AWEZNQCLSA-N
Data  1 IC50
  Tab Delimited (TSV)   2D SDfile   Computed 3D by Vconf -m prep SDfile
Find this compound or compounds like it in BindingDB:
Activity Spreadsheet -- Enzyme Inhibition Constant Data from BindingDB
Found 1 hit for monomerid = 100337
TargetChymase(Homo sapiens (Human))
Boehringer Ingelheim International
US Patent
LigandPNGBDBM100337(US8501749, 37)
Affinity DataIC50:  2.70nMpH: 8.0 T: 2°C. Assay description: In vitro inhibition assay of Chymase.
In DepthDetails US Patent