BDBM100367 US8501783, 1434
SMILES O=C(NC1CCN(CC1)C(=O)c1cccnc1)NC12CC3CC(CC(C3)C1)C2
InChI Key InChIKey=MDTRXHNMVNACLA-UHFFFAOYSA-N
Data  1 IC50
  Tab Delimited (TSV)   2D SDfile   Computed 3D by Vconf -m prep SDfile
Find this compound or compounds like it in BindingDB:
Activity Spreadsheet -- Enzyme Inhibition Constant Data from BindingDB
Found 1 hit for monomerid = 100367
TargetEpoxide hydrolase 1(Homo sapiens (Human))
The Regents Of The University Of California
US Patent
LigandPNGBDBM100367(US8501783, 1434)
Affinity DataIC50:  2.10nM. Assay description: Inhibition assay of human soluble epoxide hydrolases.
In DepthDetails US Patent