BDBM100390 US8501783, 1523
SMILES OC(=O)c1ccc(cc1)C(=O)N1CCC(CC1)NC(=O)NC12CC3CC(CC(C3)C1)C2
InChI Key InChIKey=FFPLXOLVISJYSA-UHFFFAOYSA-N
Data  1 IC50
  Tab Delimited (TSV)   2D SDfile   Computed 3D by Vconf -m prep SDfile
Find this compound or compounds like it in BindingDB:
Activity Spreadsheet -- Enzyme Inhibition Constant Data from BindingDB
Found 1 hit for monomerid = 100390
TargetEpoxide hydrolase 1(Homo sapiens (Human))
The Regents Of The University Of California
US Patent
LigandPNGBDBM100390(US8501783, 1523)
Affinity DataIC50:  3.30nM. Assay description: Inhibition assay of human soluble epoxide hydrolases.
In DepthDetails US Patent