BDBM100520 US8501732, I-80
SMILES Clc1ccc2c(c1)n(cc(CNC(=O)c1ccc(nc1)N1CCS(=O)(=O)CC1)c2=O)-c1ccccc1
InChI Key InChIKey=YNUQOABKNROQRB-UHFFFAOYSA-N
Data  1 IC50
  Tab Delimited (TSV)   2D SDfile   Computed 3D by Vconf -m prep SDfile
Find this compound or compounds like it in BindingDB:
Activity Spreadsheet -- Enzyme Inhibition Constant Data from BindingDB
Found 1 hit for monomerid = 100520
TargetMitogen-activated protein kinase 8(Homo sapiens (Human))
Hoffmann-La Roche
US Patent
LigandPNGBDBM100520(US8501732, I-80)
Affinity DataIC50:  56nM. Assay description: In vitro JNK1 assay.
In DepthDetails US Patent