BDBM100536 US8501732, I-96
SMILES Clc1ccc2c(c1)n(cc(CNC(=O)c1cnc(s1)N1CCOCC1)c2=O)-c1ccccc1
InChI Key InChIKey=PMFMODKPFQQXJU-UHFFFAOYSA-N
Data  1 IC50
  Tab Delimited (TSV)   2D SDfile   Computed 3D by Vconf -m prep SDfile
Find this compound or compounds like it in BindingDB:
Activity Spreadsheet -- Enzyme Inhibition Constant Data from BindingDB
Found 1 hit for monomerid = 100536
TargetMitogen-activated protein kinase 8(Homo sapiens (Human))
Hoffmann-La Roche
US Patent
LigandPNGBDBM100536(US8501732, I-96)
Affinity DataIC50:  55nM. Assay description: In vitro JNK1 assay.
In DepthDetails US Patent