BDBM100541 US8501732, I-101
SMILES Clc1ccc2c(c1)n(cc(CNC(=O)c1ccc(Br)nc1)c2=O)-c1ccccc1Cl
InChI Key InChIKey=CLDJPYYIQRDZGD-UHFFFAOYSA-N
Data  1 IC50
  Tab Delimited (TSV)   2D SDfile   Computed 3D by Vconf -m prep SDfile
Find this compound or compounds like it in BindingDB:
Activity Spreadsheet -- Enzyme Inhibition Constant Data from BindingDB
Found 1 hit for monomerid = 100541
TargetMitogen-activated protein kinase 8(Homo sapiens (Human))
Hoffmann-La Roche
US Patent
LigandPNGBDBM100541(US8501732, I-101)
Affinity DataIC50:  600nM. Assay description: In vitro JNK1 assay.
In DepthDetails US Patent