BDBM10062 (2R,15S)-15-methyl-2-(2-{[(methylsulfanyl)methyl]sulfanyl}ethyl)tetracyclo[8.7.0.0^{2,7}.0^{11,15}]heptadeca-1(17),6-diene-5,14-dione::3,17-Dioxo-19-[[[(methylthio)methyl]thio]methyl]androsta-4,9(11)-diene::RU54115 Analog 23
SMILES CSCSCC[C@]12CCC(=O)C=C1CCC1C3CCC(=O)[C@@]3(C)CC=C21
InChI Key InChIKey=QCMBLYSKNAJZTN-GHZCZGOHSA-N
Data  1 IC50
  Tab Delimited (TSV)   2D SDfile   Computed 3D by Vconf -m prep SDfile
Find this compound or compounds like it in BindingDB:
Activity Spreadsheet -- Enzyme Inhibition Constant Data from BindingDB
Found 1 hit for monomerid = 10062
TargetAromatase(Homo sapiens (Human))
Centre De Recherche De Roussel Uclaf
LigandPNGBDBM10062((2R,15S)-15-methyl-2-(2-{[(methylsulfanyl)methyl]s...)
Affinity DataIC50:  570nM. Assay description: The enzyme activity was assayed by measuring the formation of tritiated water from [1beta, 2beta-3H ]androstenedione in the presence of increasing co...
In DepthDetails ArticlePubMed