BDBM100632 US8501732, I-192
SMILES CC(C)(C)OC(=O)N1CCC(CC1)NC(=O)NCc1cn(-c2ccccc2)c2cc(Cl)ccc2c1=O
InChI Key InChIKey=KUUZFBFVPHQKAN-UHFFFAOYSA-N
Data  1 IC50
  Tab Delimited (TSV)   2D SDfile   Computed 3D by Vconf -m prep SDfile
Find this compound or compounds like it in BindingDB:
Activity Spreadsheet -- Enzyme Inhibition Constant Data from BindingDB
Found 1 hit for monomerid = 100632
TargetMitogen-activated protein kinase 8(Homo sapiens (Human))
Hoffmann-La Roche
US Patent
LigandPNGBDBM100632(US8501732, I-192)
Affinity DataIC50:  60nM. Assay description: In vitro JNK1 assay.
In DepthDetails US Patent