BDBM10065 (2R,15S)-15-methyl-2-[2-(methyldisulfanyl)ethyl]tetracyclo[8.7.0.0^{2,7}.0^{11,15}]heptadeca-1(17),6-diene-5,14-dione::3,17-Dioxo-19-[[(methylthio)thio]methyl]androsta-4,9(11)-diene::RU54115 Analog 27
SMILES CSSCC[C@]12CCC(=O)C=C1CCC1C3CCC(=O)[C@@]3(C)CC=C21
InChI Key InChIKey=BAYRAKQRVLHBKA-ZHAWHOEGSA-N
Data  1 IC50
  Tab Delimited (TSV)   2D SDfile   Computed 3D by Vconf -m prep SDfile
Find this compound or compounds like it in BindingDB:
Activity Spreadsheet -- Enzyme Inhibition Constant Data from BindingDB
Found 1 hit for monomerid = 10065
TargetAromatase(Homo sapiens (Human))
Centre De Recherche De Roussel Uclaf
LigandPNGBDBM10065((2R,15S)-15-methyl-2-[2-(methyldisulfanyl)ethyl]te...)
Affinity DataIC50: >1.00E+3nM. Assay description: The enzyme activity was assayed by measuring the formation of tritiated water from [1beta, 2beta-3H ]androstenedione in the presence of increasing co...
In DepthDetails ArticlePubMed