BDBM100657 US8507676, 6
SMILES C\C(=N/OCCO)c1ccc2ncc(Cc3ccc4ncccc4c3)n2n1
InChI Key InChIKey=DBLFSQIPRXMADV-ZVHZXABRSA-N
Data  1 IC50
  Tab Delimited (TSV)   2D SDfile   Computed 3D by Vconf -m prep SDfile
Find this compound or compounds like it in BindingDB:
Activity Spreadsheet -- Enzyme Inhibition Constant Data from BindingDB
Found 1 hit for monomerid = 100657
TargetHepatocyte growth factor receptor(Homo sapiens (Human))
Novartis
US Patent
LigandPNGBDBM100657(US8507676, 6)
Affinity DataIC50:  5.5nM. Assay description: The kinase assay is based on the LanthaScreen technology. LanthaScreen is the detection of Time-Resolved Fluorescence Resonance Energy Transfer (TR-...
In DepthDetails US Patent