BDBM100810 US8507533, 117::US8507533, 118::US8507533, 337
SMILES Cc1cc(ccc1C(Nc1ccc(cn1)C(=O)NCCC(O)=O)C1CCCCC1)-n1cc(cn1)C(F)(F)F
InChI Key InChIKey=JJPWRRLNNWIOGE-UHFFFAOYSA-N
Data  2 KI
  Tab Delimited (TSV)   2D SDfile   Computed 3D by Vconf -m prep SDfile
Find this compound or compounds like it in BindingDB:
Activity Spreadsheet -- Enzyme Inhibition Constant Data from BindingDB
Found 2 hits for monomerid = 100810
TargetPro-glucagon(Homo sapiens (Human))
Pfizer
US Patent
LigandPNGBDBM100810(US8507533, 117 | US8507533, 118 | US8507533, 337)
Affinity DataKi:  183nMpH: 7.4Assay Description:The Glucagon SPA assay is used to determine the ability of test compounds to block the binding of glucagon-cex to the glucagon receptors.
In DepthDetails US Patent
TargetPro-glucagon(Homo sapiens (Human))
Pfizer
US Patent
LigandPNGBDBM100810(US8507533, 117 | US8507533, 118 | US8507533, 337)
Affinity DataKi:  297nMpH: 7.4Assay Description:The Glucagon SPA assay is used to determine the ability of test compounds to block the binding of glucagon-cex to the glucagon receptors.
In DepthDetails US Patent