BDBM100937 US8524909, 125::US8524909, 22
SMILES COc1cc(cc(C)c1C(=O)N[C@@H]1COCC[C@H]1N1CCCC1)C(F)(F)F
InChI Key InChIKey=PLTVTYLSBCWJSJ-HUUCEWRRSA-N
Data  2 IC50
  Tab Delimited (TSV)   2D SDfile   Computed 3D by Vconf -m prep SDfile
Find this compound or compounds like it in BindingDB:
Activity Spreadsheet -- Enzyme Inhibition Constant Data from BindingDB
Found 2 hits for monomerid = 100937
TargetSodium- and chloride-dependent glycine transporter 1(Bos taurus (Bovine))
Hoffmann-La Roche
US Patent
LigandPNGBDBM100937(US8524909, 125 | US8524909, 22)
Affinity DataIC50:  33.8nMT: 2°C. Assay description: Glycine uptake inhibition assay.
In DepthDetails US Patent
TargetSodium- and chloride-dependent glycine transporter 1(Bos taurus (Bovine))
Hoffmann-La Roche
US Patent
LigandPNGBDBM100937(US8524909, 125 | US8524909, 22)
Affinity DataIC50:  105nMT: 2°C. Assay description: Glycine uptake inhibition assay.
In DepthDetails US Patent