BDBM101221 US8524917, 194
SMILES CCCOc1ccc2c(C(=O)NCc3ccc(F)c(F)c3)c(C(C)C)n(Cc3ccccn3)c2c1
InChI Key InChIKey=OQDIORVDAGDZKV-UHFFFAOYSA-N
Data  1 IC50
  Tab Delimited (TSV)   2D SDfile   Computed 3D by Vconf -m prep SDfile
Find this compound or compounds like it in BindingDB:
Activity Spreadsheet -- Enzyme Inhibition Constant Data from BindingDB
Found 1 hit for monomerid = 101221
TargetSphingosine 1-phosphate receptor 3(Homo sapiens (Human))
Allergan
US Patent
LigandPNGBDBM101221(US8524917, 194)
Affinity DataIC50:  15nM. Assay description: Inhibition assay using sphingosine-1-phosphate receptor 3.
In DepthDetails US Patent