BDBM101233 US8524722, 81
SMILES CN(C)C\C=C\C(=O)N1Cc2sc3ncnc(Nc4ccc(F)c(Cl)c4)c3c2C1
InChI Key InChIKey=LCOUDBVKMKTAKW-ONEGZZNKSA-N
Data  1 IC50
  Tab Delimited (TSV)   2D SDfile   Computed 3D by Vconf -m prep SDfile
Find this compound or compounds like it in BindingDB:
Activity Spreadsheet -- Enzyme Inhibition Constant Data from BindingDB
Found 1 hit for monomerid = 101233
TargetEpidermal growth factor receptor(Homo sapiens (Human))
Bayer Intellectual Property
US Patent
LigandPNGBDBM101233(US8524722, 81)
Affinity DataIC50:  12nMpH: 7.0 T: 2°C. Assay description: EGFR inhibitory activity of compounds of the present invention is quantified employing the EGFR HTRF assay.
In DepthDetails US Patent