BDBM101348 US9695151, 14
SMILES CCCS(=O)(=O)N1CC(C1)N(C)c1cncc(c1)N1C(=O)c2ccc(Cl)cc2C1(C)C
InChI Key InChIKey=UTCGJJCCPVKGQX-UHFFFAOYSA-N
Data  2 EC50
  Tab Delimited (TSV)   2D SDfile   Computed 3D by Vconf -m prep SDfile
Find this compound or compounds like it in BindingDB:
Activity Spreadsheet -- Enzyme Inhibition Constant Data from BindingDB
Found 2 hits for monomerid = 101348
TargetCytochrome P450 11B1, mitochondrial(Homo sapiens (Human))
Hoffmann-La Roche
US Patent
LigandPNGBDBM101348(US9695151, 14)
Affinity DataEC50:  25nMT: 2°C. Assay description: G-402 cells expressing CYP11 constructs were established as described above and maintained in McCoy's 5a Medium Modified, ATCC Catalog No. 30-2007 co...
In DepthDetails US Patent
TargetCytochrome P450 11B2, mitochondrial(Homo sapiens (Human))
Hoffmann-La Roche
US Patent
LigandPNGBDBM101348(US9695151, 14)
Affinity DataEC50:  0.600nMT: 2°C. Assay description: G-402 cells expressing CYP11 constructs were established as described above and maintained in McCoy's 5a Medium Modified, ATCC Catalog No. 30-2007 co...
In DepthDetails US Patent