BDBM101444 US8524710, 22
SMILES FC(F)(F)c1ccccc1S(=O)(=O)[C@H]1C[C@H](CN2CCC(F)(F)C2)N(C1)c1ccnc(n1)C#N
InChI Key InChIKey=OIZCSCPRHSSCAK-CABCVRRESA-N
Data  1 IC50
  Tab Delimited (TSV)   2D SDfile   Computed 3D by Vconf -m prep SDfile
Find this compound or compounds like it in BindingDB:
Activity Spreadsheet -- Enzyme Inhibition Constant Data from BindingDB
Found 1 hit for monomerid = 101444
TargetCathepsin S(Homo sapiens (Human))
Hoffmann-La Roche
US Patent
LigandPNGBDBM101444(US8524710, 22)
Affinity DataIC50:  3.60nM. Assay description: Enzyme activity is measured by observing the increase in fluorescence intensity caused by cleavage of a peptide substrate containing a fluorophore wh...
In DepthDetails US Patent