BDBM101446 US8524710, 24
SMILES Brc1ccccc1S(=O)(=O)[C@@H]1CCN(C1)c1ccnc(n1)C#N
InChI Key InChIKey=ACONUTHIASJRCE-LLVKDONJSA-N
Data  1 IC50
  Tab Delimited (TSV)   2D SDfile   Computed 3D by Vconf -m prep SDfile
Find this compound or compounds like it in BindingDB:
Activity Spreadsheet -- Enzyme Inhibition Constant Data from BindingDB
Found 1 hit for monomerid = 101446
TargetCathepsin S(Homo sapiens (Human))
Hoffmann-La Roche
US Patent
LigandPNGBDBM101446(US8524710, 24)
Affinity DataIC50:  0.630nM. Assay description: Enzyme activity is measured by observing the increase in fluorescence intensity caused by cleavage of a peptide substrate containing a fluorophore wh...
In DepthDetails US Patent