BDBM101718 US8530504, 82
SMILES CCCCN(C1CCOCC1)c1c(OCC)nn2c(csc12)-c1c(OC)cc(COC)cc1OC
InChI Key InChIKey=WBKJVKIORNBGJU-UHFFFAOYSA-N
Data  1 IC50
  Tab Delimited (TSV)   2D SDfile   Computed 3D by Vconf -m prep SDfile
Find this compound or compounds like it in BindingDB:
Activity Spreadsheet -- Enzyme Inhibition Constant Data from BindingDB
Found 1 hit for monomerid = 101718
TargetCorticotropin-releasing factor receptor 1(Homo sapiens (Human))
Eisai R&D Management
US Patent
LigandPNGBDBM101718(US8530504, 82)
Affinity DataIC50:  63nM. Assay description: A binding competition experiment with CRF was conducted by the SPA (GE Healthcare) method using a 96-well plate.
In DepthDetails US Patent