BDBM101853 US8530490, 116
SMILES Fc1ccc(cc1)[C@@H](NS(=O)(=O)CCCn1ccc(=O)[nH]c1=O)c1ccc(F)c(OCC2CC2)c1
InChI Key InChIKey=ZZLIFGXHYVBOEQ-HSZRJFAPSA-N
Data  1 IC50
  Tab Delimited (TSV)   2D SDfile   Computed 3D by Vconf -m prep SDfile
Find this compound or compounds like it in BindingDB:
Activity Spreadsheet -- Enzyme Inhibition Constant Data from BindingDB
Found 1 hit for monomerid = 101853
TargetDeoxyuridine 5'-triphosphate nucleotidohydrolase, mitochondrial(Homo sapiens (Human))
Taiho Pharmaceutical
US Patent
LigandPNGBDBM101853(US8530490, 116)
Affinity DataIC50:  350nM. Assay description: The inhibitory activity of the compound against human dUTPase was determined by measuring the production of [5-3H]deoxyuridine monophosphate from [5-...
In DepthDetails US Patent