BDBM10193 5-[(5-{[(2S)-1-carboxy-3-oxopropan-2-yl]carbamoyl}-5-(3-chlorophenyl)pentyl)sulfamoyl]-2-hydroxybenzoic acid::sulfonamide analog 14
SMILES OC(=O)C[C@H](NC(=O)C(CCCCNS(=O)(=O)c1ccc(O)c(c1)C(O)=O)c1cccc(Cl)c1)C=O
InChI Key InChIKey=QMXUGTZIEHBWFZ-ATNAJCNCSA-N
Data  1 KI
  Tab Delimited (TSV)   2D SDfile   Computed 3D by Vconf -m prep SDfile
Find this compound or compounds like it in BindingDB:
Activity Spreadsheet -- Enzyme Inhibition Constant Data from BindingDB
Found 1 hit for monomerid = 10193
TargetCaspase-3(Homo sapiens (Human))
Sunesis Pharmaceuticals
LigandPNGBDBM10193(5-[(5-{[(2S)-1-carboxy-3-oxopropan-2-yl]carbamoyl}...)
Affinity DataKi:  70nM ΔG°:  -9.66kcal/molepH: 7.4 T: 2°C. Assay description: The effectiveness of compounds against the activity of human recombinant caspase-1-8 was measured using fluorometric assays. Assays were carried out ...
In DepthDetails ArticlePubMed