BDBM102291 US8530648, 162
SMILES O=C1CC2(CCCN(Cc3c[nH]c4ccccc34)C2)CCN1c1nccc2ccccc12
InChI Key InChIKey=ACNWTJLIAHFHEQ-UHFFFAOYSA-N
Data  2 KI
  Tab Delimited (TSV)   2D SDfile   Computed 3D by Vconf -m prep SDfile
Find this compound or compounds like it in BindingDB:
Activity Spreadsheet -- Enzyme Inhibition Constant Data from BindingDB
Found 2 hits for monomerid = 102291
TargetOrexin receptor type 2(Homo sapiens (Human))
Novartis
US Patent
LigandPNGBDBM102291(US8530648, 162)
Affinity DataKi:  564nMpH: 7.4Assay Description:FLIPR assay using orexin receptor.
In DepthDetails US Patent
TargetOrexin/Hypocretin receptor type 1(Homo sapiens (Human))
Novartis
US Patent
LigandPNGBDBM102291(US8530648, 162)
Affinity DataKi:  1.25E+3nMpH: 7.4Assay Description:FLIPR assay using orexin receptor.
In DepthDetails US Patent