BDBM102508 US8536175, 20
SMILES COc1cc(OC)c(Cl)c(c1Cl)-c1ccc(C(=O)Nc2ncc(CN3CCN(C)CC3)[nH]2)c2nccnc12
InChI Key InChIKey=OIOCAEZDOFSWBM-UHFFFAOYSA-N
Data  1 IC50
  Tab Delimited (TSV)   2D SDfile   Computed 3D by Vconf -m prep SDfile
Find this compound or compounds like it in BindingDB:
Activity Spreadsheet -- Enzyme Inhibition Constant Data from BindingDB
Found 1 hit for monomerid = 102508
TargetFibroblast growth factor receptor 3(Homo sapiens (Human))
Novartis
US Patent
LigandPNGBDBM102508(US8536175, 20)
Affinity DataIC50:  16nM. Assay description: Protein kinase activity measured by the microfluidic caliper method.
In DepthDetails US Patent