BDBM102579 US8536172, I-28
SMILES O[C@H]1CCN(C[C@H]2CC[C@@H](CC2)Nc2nccc(n2)-n2ccc3c(cccc23)N2CCN(CC2)C(=O)CC#N)C1
InChI Key InChIKey=HSKLQQAXYWFOHP-HJOGWXRNSA-N
Data  1 IC50
  Tab Delimited (TSV)   2D SDfile   Computed 3D by Vconf -m prep SDfile
Find this compound or compounds like it in BindingDB:
Activity Spreadsheet -- Enzyme Inhibition Constant Data from BindingDB
Found 1 hit for monomerid = 102579
TargetMitogen-activated protein kinase 8(Homo sapiens (Human))
Roche Palo Alto
US Patent
LigandPNGBDBM102579(US8536172, I-28)
Affinity DataIC50:  55.5nMpH: 7.5Assay Description:JNK activity was measured by phosphorylation of GST-ATF2 (19-96) with [gamma-33P] ATP.
In DepthDetails US Patent