BDBM102600 US8536172, I-49
SMILES CS(=O)(=O)C1CCN(CC1)c1cccc2n(ccc12)-c1ccnc(N[C@H]2CC[C@@H](CC2)C(=O)N2CCN(CC2)C2CCC2)n1
InChI Key InChIKey=WBGXOLGGOVSJMV-SOAUALDESA-N
Data  1 IC50
  Tab Delimited (TSV)   2D SDfile   Computed 3D by Vconf -m prep SDfile
Find this compound or compounds like it in BindingDB:
Activity Spreadsheet -- Enzyme Inhibition Constant Data from BindingDB
Found 1 hit for monomerid = 102600
TargetMitogen-activated protein kinase 8(Homo sapiens (Human))
Roche Palo Alto
US Patent
LigandPNGBDBM102600(US8536172, I-49)
Affinity DataIC50:  59.8nMpH: 7.5Assay Description:JNK activity was measured by phosphorylation of GST-ATF2 (19-96) with [gamma-33P] ATP.
In DepthDetails US Patent