BDBM1029 Hydroxyethylene dipeptide isostere 12::tert-butyl N-[(2S,3S,5R)-5-{[(1S)-1-{[(1S)-1-carbamoyl-2-phenylethyl]carbamoyl}-3-methylbutyl]carbamoyl}-3-hydroxy-1-phenyl-5-[(4-phenylphenyl)methyl]pentan-2-yl]carbamate
SMILES CC(C)C[C@H](NC(=O)[C@@H](C[C@H](O)[C@H](Cc1ccccc1)NC(=O)OC(C)(C)C)Cc1ccc(cc1)-c1ccccc1)C(=O)N[C@@H](Cc1ccccc1)C(N)=O
InChI Key InChIKey=WRNVKZZCUAPYRR-UVEJXLBHSA-N
Data  1 IC50
  Tab Delimited (TSV)   2D SDfile   Computed 3D by Vconf -m prep SDfile
Find this compound or compounds like it in BindingDB:
Activity Spreadsheet -- Enzyme Inhibition Constant Data from BindingDB
Found 1 hit for monomerid = 1029
TargetDimer of Gag-Pol polyprotein [489-587](Human immunodeficiency virus type 1)
Merck Research Laboratories
LigandPNGBDBM1029(Hydroxyethylene dipeptide isostere 12 | tert-butyl...)
Affinity DataIC50:  0.430nMpH: 5.5 T: 2°C. Assay description: Assay of HIV protease inhibition was performed by peptide cleavage using the substrate Val-Ser-Gln-Asn-beta-naphthylalanine*Pro-Ile-Val. Products of ...
In DepthDetails ArticlePubMed