BDBM102909 US8541572, 2314
SMILES COc1ccc2CN(C[C@]3(NC(=O)NC3=O)C#Cc3ccc4c(CC[C@@]44NC(=O)NC4=O)c3)C(=O)c2c1
InChI Key InChIKey=YULZLMCWKDYBTR-CLJLJLNGSA-N
Data  1 KI  1 IC50
  Tab Delimited (TSV)   2D SDfile   Computed 3D by Vconf -m prep SDfile
Find this compound or compounds like it in BindingDB:
Activity Spreadsheet -- Enzyme Inhibition Constant Data from BindingDB
Found 1 hit for monomerid = 102909
TargetTumor necrosis factor(Homo sapiens (Human))
Merck Sharp & Dohme
US Patent
LigandPNGBDBM102909(US8541572, 2314)
Affinity DataKi:  0.240nM IC50:  281nM. Assay description: Inhibition assay using TNF-alpha.
In DepthDetails US Patent