BDBM103170 US8541407, 147
SMILES Fc1ccccc1S(=O)(=O)NC1CCN(Cc2ccc(cc2)-c2nnc3-c4ccccc4Nc4ncccc4-n23)CC1
InChI Key InChIKey=WFQJAKYCRXLZDE-UHFFFAOYSA-N
Data  1 IC50
  Tab Delimited (TSV)   2D SDfile   Computed 3D by Vconf -m prep SDfile
Find this compound or compounds like it in BindingDB:
Activity Spreadsheet -- Enzyme Inhibition Constant Data from BindingDB
Found 1 hit for monomerid = 103170
TargetRAC-alpha serine/threonine-protein kinase(Homo sapiens (Human))
Arqule
US Patent
LigandPNGBDBM103170(US8541407, 147)
Affinity DataIC50:  2.30E+3nM. Assay description: Biochemical assay using Akt AlphaScreen (Amplified Luminescent Proximity Homogeneous Assay) technology.
In DepthDetails US Patent