BDBM103406 US8546380, 799::US8633188, 799
SMILES CC1(CCSC(N)=N1)c1ccc(F)c(NC(=O)c2ccc3ccccc3n2)c1
InChI Key InChIKey=FQAMTABCBYLSGA-UHFFFAOYSA-N
Data  2 IC50
  Tab Delimited (TSV)   2D SDfile   Computed 3D by Vconf -m prep SDfile
Find this compound or compounds like it in BindingDB:
Activity Spreadsheet -- Enzyme Inhibition Constant Data from BindingDB
Found 2 hits for monomerid = 103406
TargetBeta-secretase 1(Homo sapiens (Human))
Shionogi
US Patent
LigandPNGBDBM103406(US8546380, 799 | US8633188, 799)
Affinity DataIC50:  6.70E+3nMpH: 5.0 T: 2°C. Assay description: Zero point five μL of the test compounds (dissolved in N,N′-dimethylsulfoxide) were incubated with 48.5 μL of the fluorescence-quench...
In DepthDetails US Patent
TargetBeta-secretase 1(Homo sapiens (Human))
Shionogi
US Patent
LigandPNGBDBM103406(US8546380, 799 | US8633188, 799)
Affinity DataIC50:  6.70E+3nMpH: 5.0 T: 2°C. Assay description: Inhibition assay using beta-Secretase activity.
In DepthDetails US Patent