BDBM103420 US8546380, 1132::US8633188, 1132
SMILES CC1(CCSC(N)=N1)c1cc(Br)cc(NC(=O)c2ccno2)c1
InChI Key InChIKey=YLCKZEZNPMEAHS-UHFFFAOYSA-N
Data  2 IC50
  Tab Delimited (TSV)   2D SDfile   Computed 3D by Vconf -m prep SDfile
Find this compound or compounds like it in BindingDB:
Activity Spreadsheet -- Enzyme Inhibition Constant Data from BindingDB
Found 2 hits for monomerid = 103420
TargetBeta-secretase 1(Homo sapiens (Human))
Shionogi
US Patent
LigandPNGBDBM103420(US8546380, 1132 | US8633188, 1132)
Affinity DataIC50:  2.56E+3nMpH: 5.0 T: 2°C. Assay description: Zero point five μL of the test compounds (dissolved in N,N′-dimethylsulfoxide) were incubated with 48.5 μL of the fluorescence-quench...
Ligand InfoPC cidPC sid
In DepthDetails US Patent
TargetBeta-secretase 1(Homo sapiens (Human))
Shionogi
US Patent
LigandPNGBDBM103420(US8546380, 1132 | US8633188, 1132)
Affinity DataIC50:  2.56E+3nMpH: 5.0 T: 2°C. Assay description: Inhibition assay using beta-Secretase activity.
Ligand InfoPC cidPC sid
In DepthDetails US Patent