BDBM103472 US8552004, 3.01::US8552004, 3.02
SMILES CNc1cc2c(cncc2[nH]1)-c1nc(cc(n1)C(C)(C)[S@@](C)(=N)=O)N1CCOC[C@H]1C
InChI Key InChIKey=CTVGYLGOJOMONM-AOKYCLIISA-N
Data  1 IC50
  Tab Delimited (TSV)   2D SDfile   Computed 3D by Vconf -m prep SDfile
Find this compound or compounds like it in BindingDB:
Activity Spreadsheet -- Enzyme Inhibition Constant Data from BindingDB
Found 1 hit for monomerid = 103472
TargetSerine/threonine-protein kinase ATR(Homo sapiens (Human))
Astrazeneca
US Patent
LigandPNGBDBM103472(US8552004, 3.01 | US8552004, 3.02)
Affinity DataIC50:  12.8nM. Assay description: ATM and ATR have distinct and overlapping responses to DNA damage. They must participate together and responses must be co-ordinated. Both pathways...
In DepthDetails US Patent