BDBM103568 ATX inhibitor 16::Chicago Sky Blue
SMILES COc1cc(ccc1N=Nc1ccc2c(cc(c(N)c2c1O)S([O-])(=O)=O)S([O-])(=O)=O)-c1ccc(N=Nc2ccc3c(cc(c(N)c3c2O)S([O-])(=O)=O)S([O-])(=O)=O)c(OC)c1
InChI Key InChIKey=OHMJKMNGYYWCHB-UHFFFAOYSA-J
Data  1 KI  2 IC50
  Tab Delimited (TSV)   2D SDfile   Computed 3D by Vconf -m prep SDfile
Find this compound or compounds like it in BindingDB:
Activity Spreadsheet -- Enzyme Inhibition Constant Data from BindingDB
Found 3 hits for monomerid = 103568
TargetReplicase polyprotein 1ab(2019-nCoV)
Michigan State University
LigandPNGBDBM103568(ATX inhibitor 16 | Chicago Sky Blue)
Affinity DataKi:  1.30E+3nM. Assay description: This is a review article. Please point to the original journal.
In DepthDetails ArticlePubMed
TargetEctonucleotide pyrophosphatase/phosphodiesterase family member 2(Mus musculus)
The University Of Tokyo
LigandPNGBDBM103568(ATX inhibitor 16 | Chicago Sky Blue)
Affinity DataIC50:  26nM
In DepthDetails ArticlePubMed
TargetReplicase polyprotein 1ab(2019-nCoV)
Michigan State University
LigandPNGBDBM103568(ATX inhibitor 16 | Chicago Sky Blue)
Affinity DataIC50:  7.70E+3nM. Assay description: This is a review article. Please point to the original journal.
In DepthDetails ArticlePubMed