BDBM103575 ATX inhibitor 10 analogue 5::US8551988, 65
SMILES OB(O)c1cccc(CN2CCN(CC2)C2=NC(=O)\C(S2)=C\c2ccc(Cl)c(Cl)c2)c1
InChI Key InChIKey=ZCKGWOBAJNWRNC-UNOMPAQXSA-N
Data  2 IC50
PDB links: 1 PDB ID matches this monomer.
  Tab Delimited (TSV)   2D SDfile   Computed 3D by Vconf -m prep SDfile
Find this compound or compounds like it in BindingDB:
Activity Spreadsheet -- Enzyme Inhibition Constant Data from BindingDB
Found 2 hits for monomerid = 103575
TargetEctonucleotide pyrophosphatase/phosphodiesterase family member 2(Homo sapiens (Human))
The University Of Tokyo
Curated by ChEMBL
LigandPNGBDBM103575(ATX inhibitor 10 analogue 5 | US8551988, 65)
Affinity DataIC50:  13nM. Assay description: Inhibition of ATX (unknown origin) expressed in human HEK293 cells using TG-mTMP as substrate after 2 hrs by fluorescence based plate reader assay
TargetEctonucleotide pyrophosphatase/phosphodiesterase family member 2(Mus musculus)
The University Of Tokyo
LigandPNGBDBM103575(ATX inhibitor 10 analogue 5 | US8551988, 65)
Affinity DataIC50:  13nM