BDBM103623 US8551963, 1a
SMILES CC(CO)(CO)c1cc(NC(=O)Nc2ccc(cc2)-c2cn3c(n2)sc2cc(OCCN4CCOCC4)ccc32)no1
InChI Key InChIKey=RWLXCDFZJDZLHX-UHFFFAOYSA-N
Data  5 Kd
  Tab Delimited (TSV)   2D SDfile   Computed 3D by Vconf -m prep SDfile
Find this compound or compounds like it in BindingDB:
Activity Spreadsheet -- Enzyme Inhibition Constant Data from BindingDB
Found 5 hits for monomerid = 103623
TargetReceptor-type tyrosine-protein kinase FLT3(Homo sapiens (Human))
Ambit Biosciences
US Patent
LigandPNGBDBM103623(US8551963, 1a)
Affinity DataKd:  1.60nM. Assay description: Competition binding assay used herein were developed validated and performed as described in Fabian et al., Nature Biotechnology 2005, 23, 329-336.
In DepthDetails US Patent
TargetReceptor-type tyrosine-protein kinase FLT3(Homo sapiens (Human))
Ambit Biosciences
US Patent
LigandPNGBDBM103623(US8551963, 1a)
Affinity DataKd:  3.70nM. Assay description: Competition binding assay used herein were developed validated and performed as described in Fabian et al., Nature Biotechnology 2005, 23, 329-336.
In DepthDetails US Patent
TargetReceptor-type tyrosine-protein kinase FLT3(Homo sapiens (Human))
Ambit Biosciences
US Patent
LigandPNGBDBM103623(US8551963, 1a)
Affinity DataKd:  4.10nM. Assay description: Competition binding assay used herein were developed validated and performed as described in Fabian et al., Nature Biotechnology 2005, 23, 329-336.
In DepthDetails US Patent
TargetReceptor-type tyrosine-protein kinase FLT3(Homo sapiens (Human))
Ambit Biosciences
US Patent
LigandPNGBDBM103623(US8551963, 1a)
Affinity DataKd:  2.20nM. Assay description: Competition binding assay used herein were developed validated and performed as described in Fabian et al., Nature Biotechnology 2005, 23, 329-336.
In DepthDetails US Patent
TargetReceptor-type tyrosine-protein kinase FLT3(Homo sapiens (Human))
Ambit Biosciences
US Patent
LigandPNGBDBM103623(US8551963, 1a)
Affinity DataKd:  7.10nM. Assay description: Competition binding assay used herein were developed validated and performed as described in Fabian et al., Nature Biotechnology 2005, 23, 329-336.
In DepthDetails US Patent