BDBM103709 US8563553, 134
SMILES Nc1nccc(n1)-c1nc([nH]c1-c1cccc(NS(=O)(=O)c2c(F)cccc2F)c1Cl)C1CC1
InChI Key InChIKey=ZKJBFFVDOXZLHA-UHFFFAOYSA-N
Data  1 IC50
  Tab Delimited (TSV)   2D SDfile   Computed 3D by Vconf -m prep SDfile
Find this compound or compounds like it in BindingDB:
Activity Spreadsheet -- Enzyme Inhibition Constant Data from BindingDB
Found 1 hit for monomerid = 103709
TargetSerine/threonine-protein kinase B-raf [V600E](Homo sapiens (Human))
Novartis
US Patent
LigandPNGBDBM103709(US8563553, 134)
Affinity DataIC50:  1nMpH: 7.5Assay Description:Raf/Mek amplified luminescence proximity homogeneous assay.
In DepthDetails US Patent