BDBM103961 ATX inhibitor 10::Disubstituted aryl-Me ATX inhibitor 3::Monosubstituted aryl-Me ATX inhibitor 5
SMILES CN1CCN(CC1)C1=NC(=O)\C(S1)=C\c1ccc(Cl)c(Cl)c1
InChI Key InChIKey=BSGZTQWZIBOTMJ-LCYFTJDESA-N
Data  4 IC50
PDB links: 1 PDB ID matches this monomer.
  Tab Delimited (TSV)   2D SDfile   Computed 3D by Vconf -m prep SDfile
Find this compound or compounds like it in BindingDB:
Activity Spreadsheet -- Enzyme Inhibition Constant Data from BindingDB
Found 4 hits for monomerid = 103961
TargetEctonucleotide pyrophosphatase/phosphodiesterase family member 2(Mus musculus)
The University Of Tokyo
LigandPNGBDBM103961(ATX inhibitor 10 | Disubstituted aryl-Me ATX inhib...)
Affinity DataIC50:  180nM
TargetEctonucleotide pyrophosphatase/phosphodiesterase family member 2(Homo sapiens (Human))
The University Of Tokyo
Curated by ChEMBL
LigandPNGBDBM103961(ATX inhibitor 10 | Disubstituted aryl-Me ATX inhib...)
Affinity DataIC50:  180nM. Assay description: Inhibition of ATX (unknown origin) expressed in human HEK293 cells using TG-mTMP as substrate after 2 hrs by fluorescence based plate reader assay
TargetEctonucleotide pyrophosphatase/phosphodiesterase family member 2(Mus musculus)
The University Of Tokyo
LigandPNGBDBM103961(ATX inhibitor 10 | Disubstituted aryl-Me ATX inhib...)
Affinity DataIC50:  240nM. Assay description: Inhibitory activities of hit compounds towards ENPP1-5 were calculated using pNP-TMP, and the inhibitory activities of hit compounds towards ENPP6 an...
TargetEctonucleotide pyrophosphatase/phosphodiesterase family member 2(Mus musculus)
The University Of Tokyo
LigandPNGBDBM103961(ATX inhibitor 10 | Disubstituted aryl-Me ATX inhib...)
Affinity DataIC50:  640nM. Assay description: Inhibitory activities of hit compounds towards ENPP1-5 were calculated using pNP-TMP, and the inhibitory activities of hit compounds towards ENPP6 an...