BDBM103977 Disubstituted aryl-Me ATX inhibitor 5
SMILES CN1CCN(CC1)C1=NC(=O)\C(S1)=C\c1c(Cl)cccc1Cl
InChI Key InChIKey=OYTKANKARLNNLC-LCYFTJDESA-N
Data  1 IC50
  Tab Delimited (TSV)   2D SDfile   Computed 3D by Vconf -m prep SDfile
Find this compound or compounds like it in BindingDB:
Activity Spreadsheet -- Enzyme Inhibition Constant Data from BindingDB
Found 1 hit for monomerid = 103977
TargetEctonucleotide pyrophosphatase/phosphodiesterase family member 2(Mus musculus)
The University Of Tokyo
LigandPNGBDBM103977(Disubstituted aryl-Me ATX inhibitor 5)
Affinity DataIC50:  1.10E+4nM. Assay description: Inhibitory activities of hit compounds towards ENPP1-5 were calculated using pNP-TMP, and the inhibitory activities of hit compounds towards ENPP6 an...
In DepthDetails ArticlePubMed