BDBM104041 US10047086, 22::US10640503, Example 22::US9695168, 22
SMILES CN1C(=O)Cc2cc(ccc12)-c1c(nc(OC[C@@H]2CCCN(C)C2)c2cncn12)-c1ccc(cc1)C#N
InChI Key InChIKey=PHEQJNRJHVJUFU-HXUWFJFHSA-N
Data  3 IC50
  Tab Delimited (TSV)   2D SDfile   Computed 3D by Vconf -m prep SDfile
Find this compound or compounds like it in BindingDB:
Activity Spreadsheet -- Enzyme Inhibition Constant Data from BindingDB
Found 3 hits for monomerid = 104041
TargetLysine-specific histone demethylase 1A [151-852](Homo sapiens (Human))
Incyte
US Patent
LigandPNGBDBM104041(US10047086, 22 | US10640503, Example 22 | US969516...)
Affinity DataIC50:  300nMpH: 7.5 T: 2°C. Assay description: LANCE LSD1/KDM1A demethylase assay¿10 uL of 1 nM LSD-1 enzyme (ENZO BML-SE544-0050) in the assay buffer (50 mM Tris, pH 7.5, 0.01% Tween-20, 25 mM Na...
Ligand InfoPC cidPC sid
In DepthDetails US Patent
TargetLysine-specific histone demethylase 1A(Homo sapiens (Human))
Incyte
US Patent
LigandPNGBDBM104041(US10047086, 22 | US10640503, Example 22 | US969516...)
Affinity DataIC50:  300nM. Assay description: LANCE LSD1/KDM1A demethylase assay-10 μL of 1 nM LSD-1 enzyme (ENZO BML-SE544-0050) in the assay buffer (50 mM Tris, pH 7.5, 0.01% Tween-20, 25 ...
Ligand InfoPC cidPC sid
In DepthDetails US Patent
TargetLysine-specific histone demethylase 1A(Homo sapiens (Human))
Incyte
US Patent
LigandPNGBDBM104041(US10047086, 22 | US10640503, Example 22 | US969516...)
Affinity DataIC50:  300nMpH: 7.5Assay Description:LANCE LSD1/KDM1A demethylase assay-10 μL of 1 nM LSD-1 enzyme (ENZO BML-SE544-0050) in the assay buffer (50 mM Tris, pH 7.5, 0.01% Tween-20, 25 ...
Ligand InfoPC cidPC sid
In DepthDetails US Patent