BDBM104053 PDI inhibitor P16
SMILES CC1(CCCCC1)C(=O)N[C@@H](Cc1ccc(OS(=O)(=O)C=C)cc1)C(=O)NCC#C
InChI Key InChIKey=VAHRFAIBVVFMRO-IBGZPJMESA-N
Data  1 IC50
  Tab Delimited (TSV)   2D SDfile   Computed 3D by Vconf -m prep SDfile
Find this compound or compounds like it in BindingDB:
Activity Spreadsheet -- Enzyme Inhibition Constant Data from BindingDB
Found 1 hit for monomerid = 104053
TargetProtein disulfide-isomerase(Homo sapiens (Human))
National University Of Singapore
LigandPNGBDBM104053(PDI inhibitor P16)
Affinity DataIC50:  2.30E+3nMpH: 7.0Assay Description:The assay was carried out in 384-well plates according to literature procedures [46]. Each well contained 100mM sodium phosphate and 0.2mM EDTA pH 7...
In DepthDetails ArticlePubMed