BDBM1041 CHEMBL47514::Hydroxyethylene dipeptide isostere 33::tert-butyl N-[(2S,3S,5R)-3-hydroxy-5-{[(1S,2R)-2-hydroxy-2,3-dihydro-1H-inden-1-yl]carbamoyl}-5-[(2,3,4,5,6-pentafluorophenyl)methyl]-1-phenylpentan-2-yl]carbamate
SMILES [H][C@@]1(NC(=O)[C@@H](C[C@H](O)[C@H](Cc2ccccc2)NC(=O)OC(C)(C)C)Cc2c(F)c(F)c(F)c(F)c2F)[C@H](O)Cc2ccccc12
InChI Key InChIKey=LUXWCCSCNDRTSF-BDRWXFPQSA-N
Data  3 IC50
  Tab Delimited (TSV)   2D SDfile   Computed 3D by Vconf -m prep SDfile
Find this compound or compounds like it in BindingDB:
Activity Spreadsheet -- Enzyme Inhibition Constant Data from BindingDB
Found 3 hits for monomerid = 1041
TargetDimer of Gag-Pol polyprotein [489-587](Human immunodeficiency virus type 1)
Merck Research Laboratories
LigandPNGBDBM1041(CHEMBL47514 | Hydroxyethylene dipeptide isostere 3...)
Affinity DataIC50:  0.600nMpH: 5.5 T: 2°C. Assay description: Assay of HIV protease inhibition was performed by peptide cleavage using the substrate Val-Ser-Gln-Asn-beta-naphthylalanine*Pro-Ile-Val. Products of ...
In DepthDetails ArticlePubMed
TargetGag-Pol polyprotein [489-587](Human immunodeficiency virus type 1)
Universidad De Alcal£
Curated by ChEMBL
LigandPNGBDBM1041(CHEMBL47514 | Hydroxyethylene dipeptide isostere 3...)
Affinity DataIC50:  0.600nM. Assay description: Inhibitory activity against HIV-1 protease.
In DepthDetails ArticlePubMed
TargetGag-Pol polyprotein [489-587](Human immunodeficiency virus type 1)
Universidad De Alcal£
Curated by ChEMBL
LigandPNGBDBM1041(CHEMBL47514 | Hydroxyethylene dipeptide isostere 3...)
Affinity DataIC50:  0.600nM. Assay description: In vitro inhibition of HIV-1 proteaseChecked by Author
In DepthDetails ArticlePubMed