BDBM104137 US8575145, 14
SMILES C(Oc1cccc2ccc(nc12)-c1nnc2ccccn12)C1CCNCC1
InChI Key InChIKey=CAZNIOSROXHNKZ-UHFFFAOYSA-N
Data  3 IC50
  Tab Delimited (TSV)   2D SDfile   Computed 3D by Vconf -m prep SDfile
Find this compound or compounds like it in BindingDB:
Activity Spreadsheet -- Enzyme Inhibition Constant Data from BindingDB
Found 3 hits for monomerid = 104137
TargetSerine/threonine-protein kinase pim-1(Homo sapiens (Human))
Array Biopharma
US Patent
LigandPNGBDBM104137(US8575145, 14)
Affinity DataIC50:  2nMpH: 7.4 T: 2°C. Assay description: The assay for the determination of PIM activity is based on the incorporation of [33P] ATP into PIM2tide substrate and capture of the radiolabeled pe...
In DepthDetails US Patent
TargetSerine/threonine-protein kinase pim-3(Rattus norvegicus (Rat))
Array Biopharma
US Patent
LigandPNGBDBM104137(US8575145, 14)
Affinity DataIC50:  11nMpH: 7.4 T: 2°C. Assay description: The assay for the determination of PIM activity is based on the incorporation of [33P] ATP into PIM2tide substrate and capture of the radiolabeled pe...
In DepthDetails US Patent
TargetSerine/threonine-protein kinase pim-2(Homo sapiens (Human))
Array Biopharma
US Patent
LigandPNGBDBM104137(US8575145, 14)
Affinity DataIC50:  562nMpH: 7.4 T: 2°C. Assay description: The assay for the determination of PIM activity is based on the incorporation of [33P] ATP into PIM2tide substrate and capture of the radiolabeled pe...
In DepthDetails US Patent