BDBM104483 US8575186, 246/247::US8575186, 263
SMILES COc1cc(cc2c3C4CCC(Cc3n(C)c12)N4)S(=O)(=O)c1cccc(c1)-n1cccn1
InChI Key InChIKey=STALVGVRTWPADS-UHFFFAOYSA-N
Data  2 KI
  Tab Delimited (TSV)   2D SDfile   Computed 3D by Vconf -m prep SDfile
Find this compound or compounds like it in BindingDB:
Activity Spreadsheet -- Enzyme Inhibition Constant Data from BindingDB
Found 2 hits for monomerid = 104483
Target5-hydroxytryptamine receptor 6(Homo sapiens (Human))
Albany Molecular Research
US Patent
LigandPNGBDBM104483(US8575186, 246/247 | US8575186, 263)
Affinity DataKi:  1.5nM. Assay description: The relative affinities of the various compounds for the 5-HT6 receptor were measured in a radioligand binding assay, using a sintillation proximity ...
In DepthDetails US Patent
Target5-hydroxytryptamine receptor 6(Homo sapiens (Human))
Albany Molecular Research
US Patent
LigandPNGBDBM104483(US8575186, 246/247 | US8575186, 263)
Affinity DataKi:  10nM. Assay description: The relative affinities of the various compounds for the 5-HT6 receptor were measured in a radioligand binding assay, using a sintillation proximity ...
In DepthDetails US Patent