BDBM104544 US8575201, 35
SMILES Nc1ncc(cn1)-c1ccc(cn1)C1(CCC1)c1noc(n1)-c1ccc(nc1)N1CCC[C@H]1C(O)=O
InChI Key InChIKey=ZZGWJBPKSIPENS-IBGZPJMESA-N
Data  1 IC50
  Tab Delimited (TSV)   2D SDfile   Computed 3D by Vconf -m prep SDfile
Find this compound or compounds like it in BindingDB:
Activity Spreadsheet -- Enzyme Inhibition Constant Data from BindingDB
Found 1 hit for monomerid = 104544
TargetArachidonate 5-lipoxygenase-activating protein(Homo sapiens (Human))
Boehringer Ingelheim International
US Patent
LigandPNGBDBM104544(US8575201, 35)
Affinity DataIC50:  43nM. Assay description: Compounds area assessed for the ability to bind to FLAP in a binding assay that measures compound-specific displacement of an iodinated (125I) FLAP i...
In DepthDetails US Patent