BDBM104677 US8575201, 168
SMILES CNc1cnc(cn1)-c1ccc(cn1)C1(CCC1)c1noc(n1)-c1cnn(C)c1
InChI Key InChIKey=QDELDABBWWAQRY-UHFFFAOYSA-N
Data  1 IC50
  Tab Delimited (TSV)   2D SDfile   Computed 3D by Vconf -m prep SDfile
Find this compound or compounds like it in BindingDB:
Activity Spreadsheet -- Enzyme Inhibition Constant Data from BindingDB
Found 1 hit for monomerid = 104677
TargetArachidonate 5-lipoxygenase-activating protein(Homo sapiens (Human))
Boehringer Ingelheim International
US Patent
LigandPNGBDBM104677(US8575201, 168)
Affinity DataIC50:  33nM. Assay description: Compounds area assessed for the ability to bind to FLAP in a binding assay that measures compound-specific displacement of an iodinated (125I) FLAP i...
In DepthDetails US Patent