BDBM104743 US8569308, 163
SMILES Cc1cccc(c1)C(=O)Nc1cccc(Oc2ccc(C)nc2)n1
InChI Key InChIKey=SZEKUJJHXBCXRB-UHFFFAOYSA-N
Data  1 IC50
  Tab Delimited (TSV)   2D SDfile   Computed 3D by Vconf -m prep SDfile
Find this compound or compounds like it in BindingDB:
Activity Spreadsheet -- Enzyme Inhibition Constant Data from BindingDB
Found 1 hit for monomerid = 104743
TargetMetabotropic glutamate receptor 5(Homo sapiens (Human))
Vanderbilt University
US Patent
LigandPNGBDBM104743(US8569308, 163)
Affinity DataIC50:  1.27E+4nM. Assay description: The mGluR5 activity was determined using the metabotropic glutamate receptor activity assays in human embryonic kidney cell.
In DepthDetails US Patent