BDBM104777 US8569308, 197
SMILES O=C(Nc1cc(Oc2cccnc2)ccn1)c1cccc(c1)C#N
InChI Key InChIKey=IRXQDZUKXAHEGY-UHFFFAOYSA-N
Data  1 IC50
  Tab Delimited (TSV)   2D SDfile   Computed 3D by Vconf -m prep SDfile
Find this compound or compounds like it in BindingDB:
Activity Spreadsheet -- Enzyme Inhibition Constant Data from BindingDB
Found 1 hit for monomerid = 104777
TargetMetabotropic glutamate receptor 5(Homo sapiens (Human))
Vanderbilt University
US Patent
LigandPNGBDBM104777(US8569308, 197)
Affinity DataIC50:  1.84E+3nM. Assay description: The mGluR5 activity was determined using the metabotropic glutamate receptor activity assays in human embryonic kidney cell.
In DepthDetails US Patent