BDBM104973 US8569306, 10
SMILES CS(=O)(=O)N[C@H]1CC[C@@H](CC1)Nc1nccc(n1)-c1cnc2ccccn12
InChI Key InChIKey=NXXOMTBHZVIUJY-HDJSIYSDSA-N
Data  2 IC50
  Tab Delimited (TSV)   2D SDfile   Computed 3D by Vconf -m prep SDfile
Find this compound or compounds like it in BindingDB:
Activity Spreadsheet -- Enzyme Inhibition Constant Data from BindingDB
Found 2 hits for monomerid = 104973
TargetMitogen-activated protein kinase 9(Homo sapiens (Human))
Hoffmann-La Roche
US Patent
LigandPNGBDBM104973(US8569306, 10)
Affinity DataIC50:  214nMpH: 7.5 T: 2°C. Assay description: Inhibition assay using JNK kinase.
In DepthDetails US Patent
TargetMitogen-activated protein kinase 8(Homo sapiens (Human))
Hoffmann-La Roche
US Patent
LigandPNGBDBM104973(US8569306, 10)
Affinity DataIC50:  56.7nMpH: 7.5 T: 2°C. Assay description: Inhibition assay using JNK kinase.
In DepthDetails US Patent