BDBM105180 US8569281, 224
SMILES CC(C)n1cc(cn1)-c1n[nH]c2ccnc(OC3CCOC3)c12
InChI Key InChIKey=UEBUDJGQCMCAIR-UHFFFAOYSA-N
Data  1 KI
  Tab Delimited (TSV)   2D SDfile   Computed 3D by Vconf -m prep SDfile
Find this compound or compounds like it in BindingDB:
Activity Spreadsheet -- Enzyme Inhibition Constant Data from BindingDB
Found 1 hit for monomerid = 105180
TargetLeucine-rich repeat serine/threonine-protein kinase 2(Homo sapiens (Human))
Medical Research Council Technology
US Patent
LigandPNGBDBM105180(US8569281, 224)
Affinity DataKi:  7nM. Assay description: This assay was used to determine a compound's potency in inhibiting activity of LRRK2 by determining Kiapp, IC50 or percent inhibition values.
In DepthDetails US Patent